• 大佬帮解决一下真的很着急😂

  • Failed to run MSBuild command:

    C:/Program Files (x86)/MSBuild/14.0/bin/MSBuild.exe

    to get the value of VCTargetsPath:

    Microsoft (R) Build Engine version 14.0.25420.1 Copyright (C) Microsoft Corporation. All rights reserved.

    Build started 2018/7/3 17:06:56. Project "c:\eos\eos\build\CMakeFiles\3.12.0-rc1\VCTargetsPath.vcxproj" on node 1 (default targets). C:\Program Files (x86)\MSBuild\Microsoft.Cpp\v4.0\V140\Platforms\Win32\PlatformToolsets\v140\Toolset.targets(34,5): error MSB8036: The Windows SDK version 8.1 was not found. Install the required version of Windows SDK or change the SDK version in the project property pages or by right-clicking the solution and selecting "Retarget solution". [c:\eos\eos\build\CMakeFiles\3.12.0-rc1\VCTargetsPath.vcxproj] Done Building Project "c:\eos\eos\build\CMakeFiles\3.12.0-rc1\VCTargetsPath.vcxproj" (default targets) -- FAILED.

    Build FAILED.

    "c:\eos\eos\build\CMakeFiles\3.12.0-rc1\VCTargetsPath.vcxproj" (default target) (1) -> (Desktop_PlatformPrepareForBuild target) -> C:\Program Files (x86)\MSBuild\Microsoft.Cpp\v4.0\V140\Platforms\Win32\PlatformToolsets\v140\Toolset.targets(34,5): error MSB8036: The Windows SDK version 8.1 was not found. Install the required version of Windows SDK or change the SDK version in the project property pages or by right-clicking the solution and selecting "Retarget solution". [c:\eos\eos\build\CMakeFiles\3.12.0-rc1\VCTargetsPath.vcxproj]

    0 Warning(s) 1 Error(s)

    Time Elapsed 00:00:00.18

    Exit code: 1

    这个问题如何解决啊谢谢楼主

  • 谢谢您的文章,但是对于一个新手来说照着您这文章做起来实在是吃力,您能把细节更新一下么,谢谢您了😉